{"text_format":"1","workbook":"xlsx","n_sheets":9,"sheets":["Welcome","Working Time Accounting Tool","WTA","Process 1","Process 2","Process 3","Process 4","Process 5","SOURCE"],"not_rendered":{"charts":0,"images":1,"macros":1,"external_links":0,"defined_names":7,"comments":0,"pivot_tables":0},"unopened":[],"bounds":{"document_bytes":16777216,"sheet_cells":100000,"rows_first":2000,"rows_last":500,"rows_between":2000,"halvings":0,"cell_chars":16384,"cell_head_chars":4096},"cells_cut":0,"cells_raw":0,"read":"whole","date_system":"1900"}

{"sheet":"Welcome","index":0,"n_rows":7,"n_cols":5,"rows_kept":7,"cut":false,"hidden":true,"merged":[]}
["Welcome to the Working Time Accounting Tool"]
[]
["If you see this message it means that  Macros on your computer has been disabled. "]
[]
["To run eneable macros first and then press Start button"]
[]
[null,null,null,null,"How to eneable macros:"]

{"sheet":"Working Time Accounting Tool","index":1,"n_rows":18,"n_cols":9,"rows_kept":18,"cut":false,"hidden":false,"merged":[]}
[null,"Vítame Vás v našej aplikácii Working Time Accounting Tool"]
[]
[null,"Aplikácia Working Time Accounting Tool je navrhnutá nami, teda LMCTn a slúži na meranie Vašich business procesov, ako podklad pre ich analýzu, kalkuláciu ich ceny a následnu optimalizáciu. "]
[]
[null,"V základnej verzii je možné merať 5 hlavných procesov, pričom každý hlavný proces môže obsahovať takmer neobmedzený počet podprocesov. "]
[]
[null,"Každé dôležité pole v programe je vysvetlené, pričom vysvetlenie je možné vidieť kliknutím na ?"]
[]
[null,"Pre spustenie aplikácie,  musia byť povolené makrá v Exceli."]
[]
[]
[]
[]
[]
[]
[]
[]
[null,null,null,null,null,"www.lmctn.com",null,null,"www.lmctn.sk"]

{"sheet":"WTA","index":2,"n_rows":0,"n_cols":0,"rows_kept":0,"cut":false,"hidden":true,"merged":[]}

{"sheet":"Process 1","index":3,"n_rows":1,"n_cols":11,"rows_kept":1,"cut":false,"hidden":true,"merged":[]}
[null,"Status","No.","Time","Activity Name","Criteria 1","Criteria 2","Criteria 3","Criteria 4","Criteria 5","Note"]

{"sheet":"Process 2","index":4,"n_rows":1,"n_cols":11,"rows_kept":1,"cut":false,"hidden":true,"merged":[]}
[null,"Status","No.","Time","Activity Name","Criteria 1","Criteria 2","Criteria 3","Criteria 4","Criteria 5","Note"]

{"sheet":"Process 3","index":5,"n_rows":1,"n_cols":11,"rows_kept":1,"cut":false,"hidden":true,"merged":[]}
[null,"Status","No.","Time","Activity Name","Criteria 1","Criteria 2","Criteria 3","Criteria 4","Criteria 5","Note"]

{"sheet":"Process 4","index":6,"n_rows":1,"n_cols":11,"rows_kept":1,"cut":false,"hidden":true,"merged":[]}
[null,"Status","No.","Time","Activity Name","Criteria 1","Criteria 2","Criteria 3","Criteria 4","Criteria 5","Note"]

{"sheet":"Process 5","index":7,"n_rows":1,"n_cols":11,"rows_kept":1,"cut":false,"hidden":true,"merged":[]}
[null,"Status","No.","Time","Activity Name","Criteria 1","Criteria 2","Criteria 3","Criteria 4","Criteria 5","Note"]

{"sheet":"SOURCE","index":8,"n_rows":5,"n_cols":6,"rows_kept":5,"cut":false,"hidden":true,"merged":[]}
["► ",{"$f":"VLOOKUP(\"running\",'Process 1'!$B:$B,1,)","v":{"$error":"#N/A"}},{"$f":"VLOOKUP(\"running\",'Process 2'!$B:$B,1,)","v":{"$error":"#N/A"}},{"$f":"VLOOKUP(\"running\",'Process 3'!$B:$B,1,)","v":{"$error":"#N/A"}},{"$f":"VLOOKUP(\"running\",'Process 4'!$B:$B,1,)","v":{"$error":"#N/A"}},{"$f":"VLOOKUP(\"running\",'Process 5'!$B:$B,1,)","v":{"$error":"#N/A"}}]
["▌▌",{"$f":"IFERROR(B1,1)","v":1},{"$f":"IFERROR(C1,1)","v":1},1,1,1]
[]
[1]
[2]